DCCBD

Vibrational and/or electronic energy levels

Data compiled by: Marilyn E. Jacox

State:   X

Vib.
sym.
 No.   Approximate
 type of mode
 cm-1   Med.   Method   References

a' CC stretch 1940.3 Ar IR Andrews, Hassanzadeh, et al., 1993

References

Andrews, Hassanzadeh, et al., 1993
Andrews, L.; Hassanzadeh, P.; Martin, J.M.L.; Taylor, P.R., Pulsed laser evaporated boron atom reactions with acetylene. Infrared spectra and quantum chemical structure and frequency calculations for several novel organoborane BC2H2 and HBC2 molecules, J. Phys. Chem., 1993, 97, 22, 5839, https://doi.org/10.1021/j100124a010 . [all data]