CD2SiD

Vibrational and/or electronic energy levels

Data compiled by: Marilyn E. Jacox

State:   X

Vib.
sym.
 No.   Approximate
 type of mode
 cm-1   Med.   Method   References

650 ± 15 gas PE Bengali and Leopold, 1992
370 ± 15 gas PE Bengali and Leopold, 1992

References

Bengali and Leopold, 1992
Bengali, A.A.; Leopold, D.G., Negative Ion Photoelectron Spectroscopy of CH2=SiH and CH3Si, J. Am. Chem. Soc., 1992, 114, 23, 9192, https://doi.org/10.1021/ja00049a064 . [all data]