DP(O2)O

Vibrational and/or electronic energy levels

Data compiled by: Marilyn E. Jacox

State:   X

Vib.
sym.
 No.   Approximate
 type of mode
 cm-1   Med.   Method   References

P=O stretch 1368.3 Ar IR Withnall and Andrews, 1987
PO2 s-stretch 973.5 Ar IR Withnall and Andrews, 1987
PO stretch 585.6 Ar IR Withnall and Andrews, 1987

References

Withnall and Andrews, 1987
Withnall, R.; Andrews, L., FTIR spectra of the photolysis products of the phosphine-ozone complex in solid argon, J. Phys. Chem., 1987, 91, 4, 784, https://doi.org/10.1021/j100288a008 . [all data]