PdCCD-

Vibrational and/or electronic energy levels

Data compiled by: Marilyn E. Jacox

State:   X

Vib.
sym.
 No.   Approximate
 type of mode
 cm-1   Med.   Method   References

CC stretch 1800.0 Ar IR Wang and Andrews, 2003

References

Wang and Andrews, 2003
Wang, X.; Andrews, L., Side-Bonded Pd-η, J. Phys. Chem. A, 2003, 107, 3, 337, https://doi.org/10.1021/jp0267454 . [all data]