DBeNC

Vibrational and/or electronic energy levels

Data compiled by: Marilyn E. Jacox

State:   X

Vib.
sym.
 No.   Approximate
 type of mode
 cm-1   Med.   Method   References

1 NC stretch 2098.6 Ar IR Lanzisera and Andrews, 1997
2 BeD stretch 1631.3 Ar IR Lanzisera and Andrews, 1997
3 BeN stretch 895.6 Ar IR Lanzisera and Andrews, 1997
4 D deformation 422.1 Ar IR Lanzisera and Andrews, 1997
4 D deformation 418.0 Ar IR Lanzisera and Andrews, 1997

References

Lanzisera and Andrews, 1997
Lanzisera, D.V.; Andrews, L., Reactions of Laser-Ablated Beryllium Atoms with Hydrogen Cyanide in Excess Argon. FTIR Spectra and Quantum Chemical Calculations on BeCN, BeNC, HBeCN, and HBeNC, J. Am. Chem. Soc., 1997, 119, 27, 6392, https://doi.org/10.1021/ja970740g . [all data]