DBBr2

Vibrational and/or electronic energy levels

Data compiled by: Marilyn E. Jacox

State:   X

Vib.
sym.
 No.   Approximate
 type of mode
 cm-1   Med.   Method   References

a1 1 BD stretch 1960.1 gas IR Lynds and Bass, 1964
Lynds, Wolfram, et al., 1965
Wason and Porter, 1965
2 BBr2 s-stretch 585 gas IR Lynds, Wolfram, et al., 1965
b1 4 OPLA 625 w gas IR Lynds, Wolfram, et al., 1965
b2 5 BBr2 a-stretch 870 gas IR Lynds, Wolfram, et al., 1965
Wason and Porter, 1965
6 DBBr deform. 656 gas IR Lynds, Wolfram, et al., 1965
Wason and Porter, 1965

References

Lynds and Bass, 1964
Lynds, L.; Bass, C.D., Infrared Spectrum of ν2 of Dibromoborane and Dibromoborane-d, J. Chem. Phys., 1964, 41, 10, 3165, https://doi.org/10.1063/1.1725691 . [all data]

Lynds, Wolfram, et al., 1965
Lynds, L.; Wolfram, T.; Bass, C.D., Infrared Spectrum and Vibrational Analysis of Dibromoborane and Dibromoborane-d, J. Chem. Phys., 1965, 43, 11, 3775, https://doi.org/10.1063/1.1696562 . [all data]

Wason and Porter, 1965
Wason, S.K.; Porter, R.F., None, J. Phys. Chem., 1965, 69, 7, 2461, https://doi.org/10.1021/j100891a502 . [all data]