GaD3
- Formula: D3Ga
- Molecular weight: 75.765

Vibrational and/or electronic energy levels

Data compiled by: Marilyn E. Jacox
State: X
Vib. sym. |
No. | Approximate type of mode |
cm-1 | Med. | Method | References | |
---|---|---|---|---|---|---|---|
a2 | 2 | OPLA | 519.0 | Ne | IR | Wang and Andrews, 2003 | |
2 | OPLA | 517.5 | s | Ar | IR | Pullumbi, Bouteiller, et al., 1994 Wang and Andrews, 2003 | |
2 | OPLA | 518.9 | D2 | IR | Wang and Andrews, 2003 | ||
e' | 3 | GaD3 stretch | 1394.2 | Ne | IR | Wang and Andrews, 2003 | |
3 | GaD3 stretch | 1387.7 | vs | Ar | IR | Pullumbi, Bouteiller, et al., 1994 Wang and Andrews, 2003 | |
3 | GaD3 stretch | 1391.1 | D2 | IR | Wang and Andrews, 2003 | ||
4 | Deformation | 542.9 | Ne | IR | Wang and Andrews, 2003 | ||
4 | Deformation | 544.0 | m | Ar | IR | Pullumbi, Bouteiller, et al., 1994 Wang and Andrews, 2003 | |
4 | Deformation | 542.7 | D2 | IR | Wang and Andrews, 2003 | ||

References

Wang and Andrews, 2003
Wang, X.; Andrews, L.,
Infrared Spectra of Gallium Hydrides in Solid Hydrogen: GaH,
J. Phys. Chem. A, 2003, 107, 51, 11371, https://doi.org/10.1021/jp035393d
. [all data]
Pullumbi, Bouteiller, et al., 1994
Pullumbi, P.; Bouteiller, Y.; Manceron, L.; Mijoule, C.,
Aluminium, gallium and indium trihydrides. an IR matrix isolation and ab initio study,
Chem. Phys., 1994, 185, 1, 25, https://doi.org/10.1016/0301-0104(94)00111-1
. [all data]