DPOD
- Formula: D2OP
- Molecular weight: 51.0014

Vibrational and/or electronic energy levels

Data compiled by: Marilyn E. Jacox
State: X
Vib. sym. |
No. | Approximate type of mode |
cm-1 | Med. | Method | References | |
---|---|---|---|---|---|---|---|
OD stretch | 2689.0 | Ar | IR | Withnall and Andrews, 1988 | |||
POD deform. | 821.8 | Ar | IR | Withnall and Andrews, 1988 | |||
POD deform. | 820.2 | Ar | IR | Withnall and Andrews, 1988 | |||
P-O stretch | 816.6 | Ar | IR | Withnall and Andrews, 1988 | |||
DPO deform. | 710.5 | Ar | IR | Withnall and Andrews, 1988 | |||
Torsion | 303 | Ar | IR | Withnall and Andrews, 1988 | |||

References

Withnall and Andrews, 1988
Withnall, R.; Andrews, L.,
Infrared spectra of oxygen atom-phosphine reaction products trapped in solid argon,
J. Phys. Chem., 1988, 92, 16, 4610, https://doi.org/10.1021/j100327a012
. [all data]