CuND2

Vibrational and/or electronic energy levels

Data compiled by: Marilyn E. Jacox

State:   X

Vib.
sym.
 No.   Approximate
 type of mode
 cm-1   Med.   Method   References

ND stretch 2471.7 Ar IR Ball, Hauge, et al., 1989
ND2 deform. 1147.9 Ar IR Ball, Hauge, et al., 1989

References

Ball, Hauge, et al., 1989
Ball, D.W.; Hauge, R.H.; Margrave, J.L., Infrared spectroscopic studies of the reactions of copper and ammonia in cryogenic argon matrices, Inorg. Chem., 1989, 28, 8, 1599, https://doi.org/10.1021/ic00307a035 . [all data]