DNF2+
- Formula: DF2N+
- Molecular weight: 54.0171

Vibrational and/or electronic energy levels

Data compiled by: Marilyn E. Jacox
State: X
Vib. sym. |
No. | Approximate type of mode |
cm-1 | Med. | Method | References | |
---|---|---|---|---|---|---|---|
a' | 4 | NF2 scissors | 530 ± 30 | gas | PE | Colbourne, Frost, et al., 1980 | |

References

Colbourne, Frost, et al., 1980
Colbourne, D.; Frost, D.C.; McDowell, C.A.; Westwood, N.P.C.,
The vacuum ultraviolet photoelectron spectrum of difluoramine,
Chem. Phys. Lett., 1980, 72, 247. [all data]