t-DNSO

Vibrational and/or electronic energy levels

Data compiled by: Marilyn E. Jacox

State:   X

Vib.
sym.
 No.   Approximate
 type of mode
 cm-1   Med.   Method   References

a' 2 SO stretch 1380 Ar IR Tchir and Spratley, 1975
3 NS stretch 951 Ar IR Tchir and Spratley, 1975

References

Tchir and Spratley, 1975
Tchir, P.O.; Spratley, R.D., The Photolysis of Matrix Isolated, Can. J. Chem., 1975, 53, 15, 2331, https://doi.org/10.1139/v75-326 . [all data]