DAlOD
- Formula: AlD2O
- Molecular weight: 47.0091

Vibrational and/or electronic energy levels

Data compiled by: Marilyn E. Jacox
State: X
Vib. sym. |
No. | Approximate type of mode |
cm-1 | Med. | Method | References | |
---|---|---|---|---|---|---|---|
DAl stretch | 1280.9 | Ar | IR | Hauge, Kauffman, et al., 1980 | |||
AlO stretch | 797.2 | Ar | IR | Hauge, Kauffman, et al., 1980 | |||
DAlO bend | 473.6 | Ar | IR | Hauge, Kauffman, et al., 1980 | |||

References

Hauge, Kauffman, et al., 1980
Hauge, R.H.; Kauffman, J.W.; Margrave, J.L.,
Infrared matrix-isolation studies of the interactions and reactions of Group 3A metal atoms with water,
J. Am. Chem. Soc., 1980, 102, 19, 6005, https://doi.org/10.1021/ja00539a005
. [all data]