DVOD

Vibrational and/or electronic energy levels

Data compiled by: Marilyn E. Jacox

State:   X

Vib.
sym.
 No.   Approximate
 type of mode
 cm-1   Med.   Method   References

VD stretch 1128.4 Ar IR Kauffman, Hauge, et al., 1985
Zhang, Dong, et al., 2001
VO stretch 696.6 T Ar IR Kauffman, Hauge, et al., 1985
a1 2 C=C stretch 1650 ± 120 gas PE Kauffman, Hauge, et al., 1985
3 CH2 scissors 1120 ± 100 gas PE Kauffman, Hauge, et al., 1985

References

Kauffman, Hauge, et al., 1985
Kauffman, J.W.; Hauge, R.H.; Margrave, J.L., Reactions of atomic scandium, titanium, and vanadium with molecular water at 15 K, J. Phys. Chem., 1985, 89, 16, 3547, https://doi.org/10.1021/j100262a024 . [all data]

Zhang, Dong, et al., 2001
Zhang, L.; Dong, J.; Zhou, M., Formation and characterization of the AsCO and AsCO- molecules. A matrix isolation FTIR and theoretical study, Chem. Phys. Lett., 2001, 335, 3-4, 334, https://doi.org/10.1016/S0009-2614(01)00015-X . [all data]