D3S+

Vibrational and/or electronic energy levels

Data compiled by: Marilyn E. Jacox

State:   X

Vib.
sym.
 No.   Approximate
 type of mode
 cm-1   Med.   Method   References

a1 1 SD stretch 1827.22 gas DL Xia, Sanz, et al., 1998
e 3 SD stretch 1838.62 gas DL Xia, Sanz, et al., 1998

References

Xia, Sanz, et al., 1998
Xia, C.; Sanz, M.M.; Foster, S.C., Diode Laser Spectroscopy of the ν1and ν3Bands of SD+3, J. Mol. Spectrosc., 1998, 188, 2, 175, https://doi.org/10.1006/jmsp.1997.7513 . [all data]