TbD2

Vibrational and/or electronic energy levels

Data compiled by: Marilyn E. Jacox

State:   X

Vib.
sym.
 No.   Approximate
 type of mode
 cm-1   Med.   Method   References

a1 1 TbD2 s-stretch 1031.4 Ar IR Willson and Andrews, 2000
b2 3 TbD2 a-stretch 996.0 Ar IR Willson and Andrews, 2000

References

Willson and Andrews, 2000
Willson, S.P.; Andrews, L., Characterization of the Reaction Products of Laser-Ablated Lanthanide Metal Atoms with Molecular Hydrogen. Infrared Spectra of LnH, LnH, J. Phys. Chem. A, 2000, 104, 8, 1640, https://doi.org/10.1021/jp993038a . [all data]