CrCrD

Vibrational and/or electronic energy levels

Data compiled by: Marilyn E. Jacox

State:   X

Vib.
sym.
 No.   Approximate
 type of mode
 cm-1   Med.   Method   References

Σ+ 1 CrD stretch 1092 ± 5 gas PE Casey and Leopold, 1993
Π 2 Bend 170 ± 15 gas PE Casey and Leopold, 1993
Σ+ 3 CrCr stretch 532 ± 5 gas PE Casey and Leopold, 1993

References

Casey and Leopold, 1993
Casey, S.M.; Leopold, D.G., Negative Ion Photoelectron Spectroscopy of Cr2H and Cr2D, Chem. Phys. Lett., 1993, 201, 1-4, 205, https://doi.org/10.1016/0009-2614(93)85057-U . [all data]