DOI

Vibrational and/or electronic energy levels

Data compiled by: Marilyn E. Jacox

State:   X

Vib.
sym.
 No.   Approximate
 type of mode
 cm-1   Med.   Method   References

a' 1 OD stretch 2653 N2 IR Walker, Tevault, et al., 1978
2 Bend 808 N2 IR Walker, Tevault, et al., 1978
3 OI stretch 571 N2 IR Walker, Tevault, et al., 1978

References

Walker, Tevault, et al., 1978
Walker, N.; Tevault, D.E.; Smardzewski, R.R., Matrix reactions of ozone and oxygen atoms with hydrogen iodide. HOI formation, J. Chem. Phys., 1978, 69, 2, 564, https://doi.org/10.1063/1.436647 . [all data]