C6D-

Vibrational and/or electronic energy levels

Data compiled by: Marilyn E. Jacox

State:   ?

 Energy
 (cm-1
 Med.   Transition   λmin
 (nm)
 λmax
 (nm)

References

Td = 30700 ± 120 gas Taylor, Xu, et al., 1998

State:   1Π

 Energy
 (cm-1
 Med.   Transition   λmin
 (nm)
 λmax
 (nm)

To = 30378 ± 3 gas 1Π-X 318 339 Pino, Tulej, et al., 2002

Vib.
sym.
 No.   Approximate
 type of mode
 cm-1   Med.   Method   References

Σ+ 6 680 ± 5 gas MPD Pino, Tulej, et al., 2002
Π 9 Deformation 531 T gas MPD Pino, Tulej, et al., 2002

State:   X

Vib.
sym.
 No.   Approximate
 type of mode
 cm-1   Med.   Method   References

Π 9 Deformation 416 T gas MPD Pino, Tulej, et al., 2002

Taylor, Xu, et al., 1998
Taylor, T.R.; Xu, C.; Neumark, D.M., Photoelectron spectra of the C[sub 2n]H[sup -] (n=1--4) and C[sub 2n]D[sup -] (n=1--3) anions, J. Chem. Phys., 1998, 108, 24, 10018, https://doi.org/10.1063/1.476462 . [all data]

Pino, Tulej, et al., 2002
Pino, T.; Tulej, M.; Guthe, F.; Pachkov, M.; Maier, J.P., Photodetachment spectroscopy of the C[sub 2n]H[sup -] (n=2--4) anions in the vicinity of their electron detachment threshold, J. Chem. Phys., 2002, 116, 14, 6126, https://doi.org/10.1063/1.1451248 . [all data]