DCOCN

Vibrational and/or electronic energy levels

Data compiled by: Marilyn E. Jacox

State:   A

 Energy
 (cm-1
 Med.   Transition   λmin
 (nm)
 λmax
 (nm)

References

To = 26335.6 gas A-X 345 380 Clouthier, Karolczak, et al., 1992

Vib.
sym.
 No.   Approximate
 type of mode
 cm-1   Med.   Method   References

a' 1 CD stretch 2232 gas LF Clouthier, Karolczak, et al., 1992
3 CO stretch 1279 gas LF Clouthier, Karolczak, et al., 1992
4 CC stretch 931 gas LF Clouthier, Karolczak, et al., 1992
5 CD rock 732 gas LF Clouthier, Karolczak, et al., 1992
6 CCO bend 527 gas LF Clouthier, Karolczak, et al., 1992
7 CCN bend 214 gas LF Clouthier, Karolczak, et al., 1992
a 8 Bend 406 gas LF Clouthier, Karolczak, et al., 1992
9 Bend 315 gas LF Clouthier, Karolczak, et al., 1992

Clouthier, Karolczak, et al., 1992
Clouthier, D.J.; Karolczak, J.; Rae, J.; Chan, W.-T.; Goddard, J.D.; Judge, R.H., Pyrolysis jet spectroscopy: The S1--S0 band system of formyl cyanide, HCOCN, and DCOCN, J. Chem. Phys., 1992, 97, 3, 1638, https://doi.org/10.1063/1.463152 . [all data]