YOD

Vibrational and/or electronic energy levels

Data compiled by: Marilyn E. Jacox

State:   C

 Energy
 (cm-1
 Med.   Transition   λmin
 (nm)
 λmax
 (nm)

References

To = 18472.5 gas C-X 510 542 Adam, Athanassenas, et al., 1999

Vib.
sym.
 No.   Approximate
 type of mode
 cm-1   Med.   Method   References

Π 2 Bend 339 gas LF Adam, Athanassenas, et al., 1999
Σ+ 3 YO stretch 568 gas LF Adam, Athanassenas, et al., 1999

State:   B

 Energy
 (cm-1
 Med.   Transition   λmin
 (nm)
 λmax
 (nm)

To = 16464.0 gas B-X 569 612 Adam, Athanassenas, et al., 1999

Vib.
sym.
 No.   Approximate
 type of mode
 cm-1   Med.   Method   References

Σ+ 3 YO stretch 550.86 gas LF Adam, Athanassenas, et al., 1999

State:   X

Vib.
sym.
 No.   Approximate
 type of mode
 cm-1   Med.   Method   References

Π 2 Bend 237.43 ± 0.02 gas LF Adam, Athanassenas, et al., 1999
Σ+ 3 YO stretch 655.34 ± 0.03 gas LF Adam, Athanassenas, et al., 1999
3 YO stretch 651.2 w T Ar IR Zhang, Shao, et al., 2001

Adam, Athanassenas, et al., 1999
Adam, A.G.; Athanassenas, K.; Gillett, D.A.; Kingston, C.T.; Merer, A.J.; Peers, J.R.D.; Rixon, S.J., Electronic Spectra of YOH and YOD in the Visible Region: Strong Vibronic Coupling between the B1Π and C1Σ+ States, J. Mol. Spectrosc., 1999, 196, 1, 45, https://doi.org/10.1006/jmsp.1999.7841 . [all data]

Zhang, Shao, et al., 2001
Zhang, L.; Shao, L.; Zhou, M., Reactions of laser-ablated Y and La atoms with H2O Infrared spectra and density functional calculations of the HMO, HMOH and M(OH)2 molecules in solid argon, Chem. Phys., 2001, 272, 1, 27, https://doi.org/10.1016/S0301-0104(01)00450-5 . [all data]