BiOD

Vibrational and/or electronic energy levels

Data compiled by: Marilyn E. Jacox

State:   A

 Energy
 (cm-1
 Med.   Transition   λmin
 (nm)
 λmax
 (nm)

References

To = 22815 gas Shestakov, Gielen, et al., 1998

Vib.
sym.
 No.   Approximate
 type of mode
 cm-1   Med.   Method   References

a' 3 BiO stretch 266 gas LF Shestakov, Gielen, et al., 1998

State:   a

 Energy
 (cm-1
 Med.   Transition   λmin
 (nm)
 λmax
 (nm)

To = 11294 ± 50 gas Shestakov, Gielen, et al., 1998

Vib.
sym.
 No.   Approximate
 type of mode
 cm-1   Med.   Method   References

a' 3 BiO stretch 520 ± 70 gas LF Shestakov, Gielen, et al., 1998

State:   X 3A'

 Energy
 (cm-1
 Med.   Transition   λmin
 (nm)
 λmax
 (nm)

To = 6179.3 ± 0.2 gas Fink, Shestakov, et al., 1997
Shestakov, Gielen, et al., 1998

State:   X 2A

 Energy
 (cm-1
 Med.   Transition   λmin
 (nm)
 λmax
 (nm)

To = 6168.1 gas Fink, Shestakov, et al., 1997

State:   X 1A'

Vib.
sym.
 No.   Approximate
 type of mode
 cm-1   Med.   Method   References

a' 1 OD stretch 2662 ± 50 gas LF Shestakov, Gielen, et al., 1998
3 BiO stretch 492.6 ± 0.5 gas CL LF Fink, Shestakov, et al., 1997
Shestakov, Gielen, et al., 1998

Shestakov, Gielen, et al., 1998
Shestakov, O.; Gielen, R.; Fink, E.H., LIF Studies of theÃ1A´ States of BiOH and BiOD, J. Mol. Spectrosc., 1998, 192, 1, 111, https://doi.org/10.1006/jmsp.1998.7674 . [all data]

Fink, Shestakov, et al., 1997
Fink, E.H.; Shestakov, O.; Setzer, K.D., Fine Structure Transitions of BiOH in the Near-Infrared Region, J. Mol. Spectrosc., 1997, 183, 1, 163, https://doi.org/10.1006/jmsp.1997.7262 . [all data]