ScND

Vibrational and/or electronic energy levels

Data compiled by: Marilyn E. Jacox

State:   A

 Energy
 (cm-1
 Med.   Transition   λmin
 (nm)
 λmax
 (nm)

References

To = 14952 gas Steimle, Xin, et al., 1997

State:   X

Vib.
sym.
 No.   Approximate
 type of mode
 cm-1   Med.   Method   References

Π 2 Bend 391 ± 5 gas LF Steimle, Xin, et al., 1997
Σ+ 3 ScN stretch 877 ± 5 gas LF Steimle, Xin, et al., 1997

Steimle, Xin, et al., 1997
Steimle, T.C.; Xin, J.; Marr, A.J.; Beaton, S., Detection and characterization of scandium imide, ScNH, J. Chem. Phys., 1997, 106, 22, 9084, https://doi.org/10.1063/1.474014 . [all data]