Xe2D

Vibrational and/or electronic energy levels

Data compiled by: Marilyn E. Jacox

State:   A

 Energy
 (cm-1
 Med.   Transition   λmin
 (nm)
 λmax
 (nm)

References

Ne Gurtler, Kraas, et al., 1990
To = 50070 ± 10 Ar Kraas and Gurtler, 1991
Tx = 40100 Ne Gurtler, Kraas, et al., 1990
Tx = 39800 Ar Kraas and Gurtler, 1991
Tx = 39500 Kr Kraas and Gurtler, 1992
Tx = 39500 Xe Kraas and Gurtler, 1990

Vib.
sym.
 No.   Approximate
 type of mode
 cm-1   Med.   Method   References

428 ± 10 Ar AB Kraas and Gurtler, 1991
476 ± 10 Xe AB Creuzburg, Koch, et al., 1989

Gurtler, Kraas, et al., 1990
Gurtler, P.; Kraas, M.; Tschentscher, T., Observation of XeD and Xe, Europhys. Lett., 1990, 11, 2, 115, https://doi.org/10.1209/0295-5075/11/2/004 . [all data]

Kraas and Gurtler, 1991
Kraas, M.; Gurtler, P., Xenon hydrides and deuterides in argon matrices, Chem. Phys. Lett., 1991, 187, 5, 527, https://doi.org/10.1016/0009-2614(91)80294-8 . [all data]

Kraas and Gurtler, 1992
Kraas, M.; Gurtler, P., Rare gas hydrides in rare gas matrices, Phys. Stat. Sol. (a), 1992, 130, 2, K229, https://doi.org/10.1002/pssa.2211300252 . [all data]

Kraas and Gurtler, 1990
Kraas, M.; Gurtler, P., Emission and excitation spectra of rare gas hydride trimers in rare gas matrices, Chem. Phys. Lett., 1990, 174, 5, 396, https://doi.org/10.1016/S0009-2614(90)87168-Q . [all data]

Creuzburg, Koch, et al., 1989
Creuzburg, M.; Koch, F.; Wittl, F., Low-temperature photolysis of hydrocarbons in solid xenon: Evidence for metastable XenH, Chem. Phys. Lett., 1989, 156, 4, 387, https://doi.org/10.1016/0009-2614(89)87113-1 . [all data]