DNO-

Vibrational and/or electronic energy levels

Data compiled by: Marilyn E. Jacox

State:   ?

 Energy
 (cm-1
 Med.   Transition   λmin
 (nm)
 λmax
 (nm)

References

Td = 2660 ± 120 gas Ellis and Ellison, 1983

State:   X

Vib.
sym.
 No.   Approximate
 type of mode
 cm-1   Med.   Method   References

a' 3 NO stretch 1113 ± 170 gas PE Ellis and Ellison, 1983

Ellis and Ellison, 1983
Ellis, H.B., Jr.; Ellison, G.B., Photoelectron spectroscopy of HNO- and DNO-, J. Chem. Phys., 1983, 78, 6541. [all data]