SS3

Vibrational and/or electronic energy levels

Data compiled by: Marilyn E. Jacox

State:   A

 Energy
 (cm-1
 Med.   Transition   λmin
 (nm)
 λmax
 (nm)

References

Ar A-X 575 645 Hassanzadeh and Andrews, 1992

Vib.
sym.
 No.   Approximate
 type of mode
 cm-1   Med.   Method   References

590 Ar AB Hassanzadeh and Andrews, 1992
320 Ar AB Hassanzadeh and Andrews, 1992

State:   X

Vib.
sym.
 No.   Approximate
 type of mode
 cm-1   Med.   Method   References

642.4 Ar IR Brabson, Mielke, et al., 1991
Hassanzadeh and Andrews, 1992
636 s Kr IR Meyer and Stroyer-Hansen, 1972
483 w m T Kr IR Meyer and Stroyer-Hansen, 1972
320 m T Kr IR Meyer and Stroyer-Hansen, 1972
270 w m T Kr IR Meyer and Stroyer-Hansen, 1972

Additional references: Jacox, 1994, page 214

Hassanzadeh and Andrews, 1992
Hassanzadeh, P.; Andrews, L., Vibronic absorption spectra of sulfur (S3 and S4) in solid argon, J. Phys. Chem., 1992, 96, 16, 6579, https://doi.org/10.1021/j100195a015 . [all data]

Brabson, Mielke, et al., 1991
Brabson, G.D.; Mielke, Z.; Andrews, L., Infrared spectra and structures of isotopically enriched sulfur (S3 and S4) in solid argon, J. Phys. Chem., 1991, 95, 1, 79, https://doi.org/10.1021/j100154a019 . [all data]

Meyer and Stroyer-Hansen, 1972
Meyer, B.; Stroyer-Hansen, T., Infrared spectra of S4, J. Phys. Chem., 1972, 76, 26, 3968, https://doi.org/10.1021/j100670a013 . [all data]

Jacox, 1994
Jacox, M.E., Vibrational and electronic energy levels of polyatomic transient molecules, American Chemical Society, Washington, DC, 1994, 464. [all data]