OZrOO

Vibrational and/or electronic energy levels

Data compiled by: Marilyn E. Jacox

State:   X

Vib.
sym.
 No.   Approximate
 type of mode
 cm-1   Med.   Method   References

941.1 Ar IR Chertihin and Andrews, 1995

Additional references: Jacox, 1998, page 250

References

Chertihin and Andrews, 1995
Chertihin, G.V.; Andrews, L., Reactions of Laser Ablated Titanium, Zirconium, and Hafnium Atoms with Oxygen Molecules in Condensing Argon, J. Phys. Chem., 1995, 99, 17, 6356, https://doi.org/10.1021/j100017a015 . [all data]

Jacox, 1998
Jacox, M.E., Vibrational and electronic energy levels of polyatomic transient molecules: supplement A, J. Phys. Chem. Ref. Data, 1998, 27, 2, 115-393, https://doi.org/10.1063/1.556017 . [all data]