cyc-TlO2Tl

Vibrational and/or electronic energy levels

Data compiled by: Marilyn E. Jacox

State:   X

Vib.
sym.
 No.   Approximate
 type of mode
 cm-1   Med.   Method   References

422 Ar IR Kelsall and Carlson, 1980
Andrews, Kushto, et al., 1997
422.7 N2 IR Kelsall and Carlson, 1980

Additional references: Jacox, 2003, page 223

References

Kelsall and Carlson, 1980
Kelsall, B.J.; Carlson, K.D., Matrix reactions of molecular oxygen with thallium atoms, J. Phys. Chem., 1980, 84, 9, 951, https://doi.org/10.1021/j100446a004 . [all data]

Andrews, Kushto, et al., 1997
Andrews, L.; Kushto, G.P.; Yustein, J.T.; Archibong, E.; Sullivan, R.; Leszczynski, J., Reactions of Pulsed-Laser-Evaporated Thallium Atoms with O, J. Phys. Chem. A, 1997, 101, 48, 9077, https://doi.org/10.1021/jp9723325 . [all data]

Jacox, 2003
Jacox, M.E., Vibrational and electronic energy levels of polyatomic transient molecules: supplement B, J. Phys. Chem. Ref. Data, 2003, 32, 1, 1-441, https://doi.org/10.1063/1.1497629 . [all data]