Ni2O3

Vibrational and/or electronic energy levels

Data compiled by: Marilyn E. Jacox

State:   X

Vib.
sym.
 No.   Approximate
 type of mode
 cm-1   Med.   Method   References

962.3 Ar IR Citra, Chertihin, et al., 1997

Additional references: Jacox, 2003, page 288

References

Citra, Chertihin, et al., 1997
Citra, A.; Chertihin, G.V.; Andrews, L.; Neurock, M., Reactions of Laser-Ablated Nickel Atoms with Dioxygen. Infrared Spectra and Density Functional Calculations of Nickel Oxides NiO, ONiO, Ni, J. Phys. Chem. A, 1997, 101, 17, 3109, https://doi.org/10.1021/jp970019x . [all data]

Jacox, 2003
Jacox, M.E., Vibrational and electronic energy levels of polyatomic transient molecules: supplement B, J. Phys. Chem. Ref. Data, 2003, 32, 1, 1-441, https://doi.org/10.1063/1.1497629 . [all data]