PtNN-

Vibrational and/or electronic energy levels

Data compiled by: Marilyn E. Jacox

State:   X

Vib.
sym.
 No.   Approximate
 type of mode
 cm-1   Med.   Method   References

1 NN stretch 2054.1 Ne IR Citra, Wang, et al., 2001
1 NN stretch 2045.8 Ar IR Citra, Wang, et al., 2001
1 NN stretch 2048.9 N2 IR Citra, Wang, et al., 2001

Additional references: Jacox, 2003, page 87

References

Citra, Wang, et al., 2001
Citra, A.; Wang, X.; Bare, W.D.; Andrews, L., Reactions of Laser-Ablated Platinum with Nitrogen: Matrix Infrared Spectra of Platinum Nitride, Complexes, and Anions, J. Phys. Chem. A, 2001, 105, 33, 7799, https://doi.org/10.1021/jp011542l . [all data]

Jacox, 2003
Jacox, M.E., Vibrational and electronic energy levels of polyatomic transient molecules: supplement B, J. Phys. Chem. Ref. Data, 2003, 32, 1, 1-441, https://doi.org/10.1063/1.1497629 . [all data]