SeSeSeN

Vibrational and/or electronic energy levels

Data compiled by: Marilyn E. Jacox

State:   X

Vib.
sym.
 No.   Approximate
 type of mode
 cm-1   Med.   Method   References

527 Ar IR Andrews, Hassanzadeh, et al., 1996

Additional references: Jacox, 1998, page 258

References

Andrews, Hassanzadeh, et al., 1996
Andrews, L.; Hassanzadeh, P.; Lanzisera, D.V.; Brabson, G.D., Reactions of Selenium in a Quartz Discharge Tube. Infrared Spectra and Density Functional Theory Calculations of New Selenium-Nitrogen and Selenium-Silicon Species in Solid Argon, J. Phys. Chem., 1996, 100, 41, 16667, https://doi.org/10.1021/jp961288a . [all data]

Jacox, 1998
Jacox, M.E., Vibrational and electronic energy levels of polyatomic transient molecules: supplement A, J. Phys. Chem. Ref. Data, 1998, 27, 2, 115-393, https://doi.org/10.1063/1.556017 . [all data]