c-OONO-

Vibrational and/or electronic energy levels

Data compiled by: Marilyn E. Jacox

State:   X

Vib.
sym.
 No.   Approximate
 type of mode
 cm-1   Med.   Method   References

a' 1 N=O stretch 1458.3 Ar IR Liang and Andrews, 2001
3 806.1 Ar IR Liang and Andrews, 2001

Additional references: Jacox, 2003, page 239

References

Liang and Andrews, 2001
Liang, B.; Andrews, L., Infrared Spectra of, J. Am. Chem. Soc., 2001, 123, 40, 9848, https://doi.org/10.1021/ja0114299 . [all data]

Jacox, 2003
Jacox, M.E., Vibrational and electronic energy levels of polyatomic transient molecules: supplement B, J. Phys. Chem. Ref. Data, 2003, 32, 1, 1-441, https://doi.org/10.1063/1.1497629 . [all data]