NSmO

Vibrational and/or electronic energy levels

Data compiled by: Marilyn E. Jacox

State:   X

Vib.
sym.
 No.   Approximate
 type of mode
 cm-1   Med.   Method   References

Mixed 736.9 Ar IR Willson, Andrews, et al., 2000

Additional references: Jacox, 2003, page 94

References

Willson, Andrews, et al., 2000
Willson, S.P.; Andrews, L.; Neurock, M., Characterization of the Reaction Products of Laser-Ablated Lanthanide Metal Atoms with Nitric Oxide. Infrared Spectra of the NLnO Molecules in Solid Argon, J. Phys. Chem. A, 2000, 104, 16, 3446, https://doi.org/10.1021/jp992727j . [all data]

Jacox, 2003
Jacox, M.E., Vibrational and electronic energy levels of polyatomic transient molecules: supplement B, J. Phys. Chem. Ref. Data, 2003, 32, 1, 1-441, https://doi.org/10.1063/1.1497629 . [all data]