cyc-InP2

Vibrational and/or electronic energy levels

Data compiled by: Marilyn E. Jacox

State:   A

 Energy
 (cm-1
 Med.   Transition   λmin
 (nm)
 λmax
 (nm)

References

To = 10330 ± 8 gas Xu, de Beer, et al., 1994
Arnold and Neumark, 1994

Vib.
sym.
 No.   Approximate
 type of mode
 cm-1   Med.   Method   References

a1 2 PInP s-stretch 287 gas TPE Arnold and Neumark, 1994

State:   X

Vib.
sym.
 No.   Approximate
 type of mode
 cm-1   Med.   Method   References

a1 1 P=P stretch 479 gas TPE Arnold and Neumark, 1994
2 PInP s-stretch 190.0 ± 0.2 gas TPE Arnold and Neumark, 1994

Additional references: Jacox, 2003, page 98

Xu, de Beer, et al., 1994
Xu, C.; de Beer, E.; Arnold, D.W.; Arnold, C.C.; Neumark, D.M., Anion photoelectron spectroscopy of small indium phosphide clusters (InxP-y; x,y=1--4), J. Chem. Phys., 1994, 101, 6, 5406, https://doi.org/10.1063/1.467393 . [all data]

Arnold and Neumark, 1994
Arnold, C.C.; Neumark, D.M., Study of In2P/In2P- and InP2/InP2- using negative ion zero electron kinetic energy spectroscopy, Can. J. Phys., 1994, 72, 11-12, 1322, https://doi.org/10.1139/p94-168 . [all data]

Jacox, 2003
Jacox, M.E., Vibrational and electronic energy levels of polyatomic transient molecules: supplement B, J. Phys. Chem. Ref. Data, 2003, 32, 1, 1-441, https://doi.org/10.1063/1.1497629 . [all data]