GeNNGe

Vibrational and/or electronic energy levels

Data compiled by: Marilyn E. Jacox

State:   X

Vib.
sym.
 No.   Approximate
 type of mode
 cm-1   Med.   Method   References

Σu 3 GeN a-stretch 887.9 N2 IR Bahou, Sankaran, et al., 2003

References

Bahou, Sankaran, et al., 2003
Bahou, M.; Sankaran, K.; Wu, Y.-J.; Lee, Y.-P.; Rayner, D.; Simard, B., Isomers of Ge[sub 2]N[sub 2]: Production and infrared absorption of GeNNGe in solid N[sub 2], J. Chem. Phys., 2003, 118, 21, 9710, https://doi.org/10.1063/1.1569907 . [all data]