H2Ga(H)GaH2
- Formula: Ga2H5
- Molecular weight: 144.486

Vibrational and/or electronic energy levels

Data compiled by: Marilyn E. Jacox
State: X
Vib. sym. |
No. | Approximate type of mode |
cm-1 | Med. | Method | References | |
---|---|---|---|---|---|---|---|
GaH stretch | 1980.5 | H2 | IR | Wang and Andrews, 2003 | |||
GaH stretch | 1943.9 | H2 | IR | Wang and Andrews, 2003 | |||
782.1 | H2 | IR | Wang and Andrews, 2003 | ||||

References

Wang and Andrews, 2003
Wang, X.; Andrews, L.,
Infrared Spectra of Gallium Hydrides in Solid Hydrogen: GaH,
J. Phys. Chem. A, 2003, 107, 51, 11371, https://doi.org/10.1021/jp035393d
. [all data]