Co(NO)2-

Vibrational and/or electronic energy levels

Data compiled by: Marilyn E. Jacox

State:   X

Vib.
sym.
 No.   Approximate
 type of mode
 cm-1   Med.   Method   References

NO a-stretch 1593.8 Ne IR Zhou and Andrews, 2000

Additional references: Jacox, 2003, page 295

References

Zhou and Andrews, 2000
Zhou, M.; Andrews, L., Reactions of Laser-Ablated Fe, Co, and Ni with NO: Infrared Spectra and Density Functional Calculations of MNO, J. Phys. Chem. A, 2000, 104, 17, 3915, https://doi.org/10.1021/jp993340j . [all data]

Jacox, 2003
Jacox, M.E., Vibrational and electronic energy levels of polyatomic transient molecules: supplement B, J. Phys. Chem. Ref. Data, 2003, 32, 1, 1-441, https://doi.org/10.1063/1.1497629 . [all data]