H2GaCl2GaH2

Vibrational and/or electronic energy levels

Data compiled by: Marilyn E. Jacox

State:   X

Vib.
sym.
 No.   Approximate
 type of mode
 cm-1   Med.   Method   References

b2u 8 GaH a-stretch 2020 s Ar IR Pulham, Downs, et al., 1995
9 GaH2 rock 480 w Ar IR Pulham, Downs, et al., 1995
b1u 13 GaH2 wag 578 m Ar IR Pulham, Downs, et al., 1995
14 GaCl stretch 290 w s Ar IR Pulham, Downs, et al., 1995
b3u 16 GaH s-stretch 1985 m Ar IR Pulham, Downs, et al., 1995
17 GaH2 scissors 690 s Ar IR Pulham, Downs, et al., 1995
18 GaCl s-stretch 265 s Ar IR Pulham, Downs, et al., 1995

Additional references: Jacox, 1998, page 339

References

Pulham, Downs, et al., 1995
Pulham, C.R.; Downs, A.J.; Goode, M.J.; Mills, I.M., Spectrochim. Acta, 1995, 51A, 769. [all data]

Jacox, 1998
Jacox, M.E., Vibrational and electronic energy levels of polyatomic transient molecules: supplement A, J. Phys. Chem. Ref. Data, 1998, 27, 2, 115-393, https://doi.org/10.1063/1.556017 . [all data]