C7N-

Vibrational and/or electronic energy levels

Data compiled by: Marilyn E. Jacox

State:   1S+

 Energy
 (cm-1
 Med.   Transition   λmin
 (nm)
 λmax
 (nm)

References

To = 36496 ± 27 Ne 1S+-X 249 274 Grutter, Wyss, et al., 1999

Vib.
sym.
 No.   Approximate
 type of mode
 cm-1   Med.   Method   References

Σ+ CC,CN stretch 2054 ± 38 Ne AB Grutter, Wyss, et al., 1999
C-C stretch 1599 ± 38 Ne AB Grutter, Wyss, et al., 1999
C-C stretch 1069 ± 38 Ne AB Grutter, Wyss, et al., 1999
C-C stretch 472 ± 38 Ne AB Grutter, Wyss, et al., 1999

State:   X

Vib.
sym.
 No.   Approximate
 type of mode
 cm-1   Med.   Method   References

Σ+ 2124 Ne IR Grutter, Wyss, et al., 1999
2074 Ne IR Grutter, Wyss, et al., 1999

Additional references: Jacox, 2003, page 362

Grutter, Wyss, et al., 1999
Grutter, M.; Wyss, M.; Maier, J.P., Electronic absorption spectra of C[sub 2n]H[sup -], C[sub 2n-1]N[sup -] (n=4--7), and C[sub 2n-1]N (n=3--7) chains in neon matrices, J. Chem. Phys., 1999, 110, 3, 1492, https://doi.org/10.1063/1.478022 . [all data]

Jacox, 2003
Jacox, M.E., Vibrational and electronic energy levels of polyatomic transient molecules: supplement B, J. Phys. Chem. Ref. Data, 2003, 32, 1, 1-441, https://doi.org/10.1063/1.1497629 . [all data]