C(NC)2
- Formula: C3N2
- Molecular weight: 64.0455

Vibrational and/or electronic energy levels

Data compiled by: Marilyn E. Jacox
State: X
Vib. sym. |
No. | Approximate type of mode |
cm-1 | Med. | Method | References | |
---|---|---|---|---|---|---|---|
a1 | 1 | NC s-stretch | 2008.1 | w m | Ar | IR | Maier, Reisenauer, et al. |
2 | NCN s-stretch | 931.3 | w | Ar | IR | Maier, Reisenauer, et al. | |
3 | 592 | T | Ar | IR | Maier, Reisenauer, et al. | ||
b2 | 7 | NC a-stretch | 1916.8 | vs | Ar | IR | Maier, Reisenauer, et al. |
8 | NCN a-stretch | 1145.8 | m | Ar | IR | Maier, Reisenauer, et al. | |

References

Maier, Reisenauer, et al.
Maier, G.; Reisenauer, H.P.; Ruppel, R.,
J. Org. Chem. 2003, 2695.. [all data]