H2C=(cyc-CN=CH)
- Formula: C3H3N
- Molecular weight: 53.0626

Vibrational and/or electronic energy levels

Data compiled by: Marilyn E. Jacox
State: X
Vib. sym. |
No. | Approximate type of mode |
cm-1 | Med. | Method | References | |
---|---|---|---|---|---|---|---|
1818 | Kr | IR | Banert, Hagedorn, et al., 1994 | ||||
Additional references: Jacox, 1998, page 326

References

Banert, Hagedorn, et al., 1994
Banert, K.; Hagedorn, M.; Knozinger, E.; Becker, A.; Wurthwein, E.-U.,
Reactions of unsaturated azides. 11. Direct observation of 2-methylene-2H-azirine,
J. Am. Chem. Soc., 1994, 116, 1, 60, https://doi.org/10.1021/ja00080a007
. [all data]
Jacox, 1998
Jacox, M.E.,
Vibrational and electronic energy levels of polyatomic transient molecules: supplement A,
J. Phys. Chem. Ref. Data, 1998, 27, 2, 115-393, https://doi.org/10.1063/1.556017
. [all data]