CH3CCCa
- Formula: C3H3Ca
- Molecular weight: 79.134

Vibrational and/or electronic energy levels

Data compiled by: Marilyn E. Jacox
State: B
Energy (cm-1) |
Med. | Transition | λmin (nm) |
λmax (nm) |
References | ||
---|---|---|---|---|---|---|---|
To = 16861 | gas | Corlett, Patel, et al., 2003 | |||||
Vib. sym. |
No. | Approximate type of mode |
cm-1 | Med. | Method | References | |
---|---|---|---|---|---|---|---|
a1 | 5 | CaC stretch | 362 | gas | LF | Corlett, Patel, et al., 2003 | |
State: A
Energy (cm-1) |
Med. | Transition | λmin (nm) |
λmax (nm) |
References | ||
---|---|---|---|---|---|---|---|
To = 16138 | gas | Corlett, Patel, et al., 2003 | |||||
Vib. sym. |
No. | Approximate type of mode |
cm-1 | Med. | Method | References | |
---|---|---|---|---|---|---|---|
a1 | 5 | CaC stretch | 370 | gas | LF | Corlett, Patel, et al., 2003 | |
State: X
Vib. sym. |
No. | Approximate type of mode |
cm-1 | Med. | Method | References | |
---|---|---|---|---|---|---|---|
a1 | 5 | CaC stretch | 364 ± 5 | gas | LF | Corlett, Patel, et al., 2003 | |

References

Corlett, Patel, et al., 2003
Corlett, G.K.; Patel, K.; Wheeler, M.D.; Ellis, A.M.,
Electronic spectroscopy of the CaCCCH3 and SrCCCH3 free radicals,
Phys. Chem. Chem. Phys., 2003, 5, 1, 36, https://doi.org/10.1039/b207716g
. [all data]