CH3CH2O+

Vibrational and/or electronic energy levels

Data compiled by: Marilyn E. Jacox

State:   ?

 Energy
 (cm-1
 Med.   Transition   λmin
 (nm)
 λmax
 (nm)

References

Txx = 22190 ± 120 gas Wang, Sun, et al., 2001

State:   b

 Energy
 (cm-1
 Med.   Transition   λmin
 (nm)
 λmax
 (nm)

Txx = 9280 ± 120 gas Wang, Sun, et al., 2001

Vib.
sym.
 No.   Approximate
 type of mode
 cm-1   Med.   Method   References

a' 1170 ± 60 gas PE Wang, Sun, et al., 2001

State:   a

 Energy
 (cm-1
 Med.   Transition   λmin
 (nm)
 λmax
 (nm)

Txx = 5320 ± 120 gas Wang, Sun, et al., 2001

State:   X

Vib.
sym.
 No.   Approximate
 type of mode
 cm-1   Med.   Method   References

a' 1260 ± 60 gas PE Wang, Sun, et al., 2001

Additional references: Jacox, 2003, page 352

Wang, Sun, et al., 2001
Wang, J.; Sun, Z.; Zhu, X.; Ge, M.; Wang, D., First experimental observation on different ionic states of the CH3CH2O radical: a HeI photoelectron spectrum of the ethoxy CH3CH2O radical, Chem. Phys. Lett., 2001, 340, 1-2, 98, https://doi.org/10.1016/S0009-2614(01)00377-3 . [all data]

Jacox, 2003
Jacox, M.E., Vibrational and electronic energy levels of polyatomic transient molecules: supplement B, J. Phys. Chem. Ref. Data, 2003, 32, 1, 1-441, https://doi.org/10.1063/1.1497629 . [all data]