CdC2H5

Vibrational and/or electronic energy levels

Data compiled by: Marilyn E. Jacox

State:   A

 Energy
 (cm-1
 Med.   Transition   λmin
 (nm)
 λmax
 (nm)

References

To = 21374 ± 5 gas A-X 467 488 Bezant and Ellis, 1997

State:   X

Vib.
sym.
 No.   Approximate
 type of mode
 cm-1   Med.   Method   References

a' 880 ± 5 gas LF Bezant and Ellis, 1997
10 CdC stretch 278 ± 5 gas LF Bezant and Ellis, 1997
11 CdCC bend 157 ± 5 gas LF Bezant and Ellis, 1997

Additional references: Jacox, 2003, page 349

Bezant and Ellis, 1997
Bezant, A.J.; Ellis, A.M., First Spectroscopic Observation of the CdC2H5Radical, J. Mol. Spectrosc., 1997, 185, 1, 54, https://doi.org/10.1006/jmsp.1997.7362 . [all data]

Jacox, 2003
Jacox, M.E., Vibrational and electronic energy levels of polyatomic transient molecules: supplement B, J. Phys. Chem. Ref. Data, 2003, 32, 1, 1-441, https://doi.org/10.1063/1.1497629 . [all data]