cyc-C2H2Cr

Vibrational and/or electronic energy levels

Data compiled by: Marilyn E. Jacox

State:   X

Vib.
sym.
 No.   Approximate
 type of mode
 cm-1   Med.   Method   References

a1 CC stretch 1476.4 Ar IR Huang, Zeng, et al., 2003
b1 CCH deform. 991.9 Ar IR Huang, Zeng, et al., 2003

References

Huang, Zeng, et al., 2003
Huang, Z.; Zeng, A.; Dong, J.; Zhou, M., Matrix Isolation Fourier Transform Infrared Spectroscopic and Density Functional Theoretical Studies of the Reactions of Chromium Atoms and Acetylene, J. Phys. Chem. A, 2003, 107, 13, 2329, https://doi.org/10.1021/jp022092f . [all data]