BeCCH

Vibrational and/or electronic energy levels

Data compiled by: Marilyn E. Jacox

State:   X

Vib.
sym.
 No.   Approximate
 type of mode
 cm-1   Med.   Method   References

Σ+ 2 CC stretch 2018.9 Ar IR Thompson and Andrews, 1996
3 BeC stretch 855.0 Ar IR Thompson and Andrews, 1996
Π 4 HCC bend 675.7 Ar IR Thompson and Andrews, 1996

Additional references: Jacox, 1998, page 231

References

Thompson and Andrews, 1996
Thompson, C.A.; Andrews, L., Reactions of Laser-Ablated Be and Mg Atoms with C, J. Am. Chem. Soc., 1996, 118, 42, 10242, https://doi.org/10.1021/ja9616847 . [all data]

Jacox, 1998
Jacox, M.E., Vibrational and electronic energy levels of polyatomic transient molecules: supplement A, J. Phys. Chem. Ref. Data, 1998, 27, 2, 115-393, https://doi.org/10.1063/1.556017 . [all data]