HCCB
- Formula: C2HB
- Molecular weight: 35.840

Vibrational and/or electronic energy levels

Data compiled by: Marilyn E. Jacox
State: X
Vib. sym. |
No. | Approximate type of mode |
cm-1 | Med. | Method | References | |
---|---|---|---|---|---|---|---|
CC stretch | 2039.3 | Ar | IR | Andrews, Hassanzadeh, et al., 1993 | |||
Additional references: Jacox, 1998, page 232

References

Andrews, Hassanzadeh, et al., 1993
Andrews, L.; Hassanzadeh, P.; Martin, J.M.L.; Taylor, P.R.,
Pulsed laser evaporated boron atom reactions with acetylene. Infrared spectra and quantum chemical structure and frequency calculations for several novel organoborane BC2H2 and HBC2 molecules,
J. Phys. Chem., 1993, 97, 22, 5839, https://doi.org/10.1021/j100124a010
. [all data]
Jacox, 1998
Jacox, M.E.,
Vibrational and electronic energy levels of polyatomic transient molecules: supplement A,
J. Phys. Chem. Ref. Data, 1998, 27, 2, 115-393, https://doi.org/10.1063/1.556017
. [all data]