HBCC
- Formula: C2HB
- Molecular weight: 35.840

Vibrational and/or electronic energy levels

Data compiled by: Marilyn E. Jacox
State: X
Vib. sym. |
No. | Approximate type of mode |
cm-1 | Med. | Method | References | |
---|---|---|---|---|---|---|---|
Σ+ | 1 | BH stretch | 2763.2 | Ar | IR | Andrews, Lanzisera, et al., 1998 | |
2 | CC stretch | 1995.3 | Ar | IR | Andrews, Hassanzadeh, et al., 1993 Andrews, Lanzisera, et al., 1998 | ||
Additional references: Jacox, 1998, page 232; Jacox, 2003, page 183

References

Andrews, Lanzisera, et al., 1998
Andrews, L.; Lanzisera, D.V.; Hassanzadeh, P.; Hannachi, Y.,
Reactions of Laser-Ablated Boron Atoms with Ethylene and Ethane. Infrared Spectra and DFT Calculations for Several Novel BC,
J. Phys. Chem. A, 1998, 102, 19, 3259, https://doi.org/10.1021/jp980437h
. [all data]
Andrews, Hassanzadeh, et al., 1993
Andrews, L.; Hassanzadeh, P.; Martin, J.M.L.; Taylor, P.R.,
Pulsed laser evaporated boron atom reactions with acetylene. Infrared spectra and quantum chemical structure and frequency calculations for several novel organoborane BC2H2 and HBC2 molecules,
J. Phys. Chem., 1993, 97, 22, 5839, https://doi.org/10.1021/j100124a010
. [all data]
Jacox, 1998
Jacox, M.E.,
Vibrational and electronic energy levels of polyatomic transient molecules: supplement A,
J. Phys. Chem. Ref. Data, 1998, 27, 2, 115-393, https://doi.org/10.1063/1.556017
. [all data]
Jacox, 2003
Jacox, M.E.,
Vibrational and electronic energy levels of polyatomic transient molecules: supplement B,
J. Phys. Chem. Ref. Data, 2003, 32, 1, 1-441, https://doi.org/10.1063/1.1497629
. [all data]