TaCO

Vibrational and/or electronic energy levels

Data compiled by: Marilyn E. Jacox

State:   X

Vib.
sym.
 No.   Approximate
 type of mode
 cm-1   Med.   Method   References

1 CO stretch 1865.2 Ne IR Zhou and Andrews, 1999
1 CO stretch 1862.5 Ne IR Zhou and Andrews, 1999
1 CO stretch 1831 T Ar IR DeKock, 1971
1 CO stretch 1819 T Ar IR DeKock, 1971

Additional references: Jacox, 1998, page 166; Jacox, 2003, page 65

References

Zhou and Andrews, 1999
Zhou, M.; Andrews, L., Infrared Spectra of CNbO, CMO, J. Phys. Chem. A, 1999, 103, 39, 7785, https://doi.org/10.1021/jp991552a . [all data]

DeKock, 1971
DeKock, R.L., Preparation and identification of intermediate carbonyls of nickel and tantalum by matrix isolation, Inorg. Chem., 1971, 10, 6, 1205, https://doi.org/10.1021/ic50100a022 . [all data]

Jacox, 1998
Jacox, M.E., Vibrational and electronic energy levels of polyatomic transient molecules: supplement A, J. Phys. Chem. Ref. Data, 1998, 27, 2, 115-393, https://doi.org/10.1063/1.556017 . [all data]

Jacox, 2003
Jacox, M.E., Vibrational and electronic energy levels of polyatomic transient molecules: supplement B, J. Phys. Chem. Ref. Data, 2003, 32, 1, 1-441, https://doi.org/10.1063/1.1497629 . [all data]