NiCO+
- Formula: CNiO+
- Molecular weight: 86.7030

Vibrational and/or electronic energy levels

Data compiled by: Marilyn E. Jacox
State: X
Vib. sym. |
No. | Approximate type of mode |
cm-1 | Med. | Method | References | |
---|---|---|---|---|---|---|---|
1 | CO stretch | 2206.5 | Ne | IR | Liang, Zhou, et al., 2000 | ||
1 | CO stretch | 2176.3 | Ar | IR | Liang, Zhou, et al., 2000 | ||
Additional references: Jacox, 2003, page 61

References

Liang, Zhou, et al., 2000
Liang, B.; Zhou, M.; Andrews, L.,
Reactions of Laser-Ablated Ni, Pd, and Pt Atoms with Carbon Monoxide: Matrix Infrared Spectra and Density Functional Calculations on M(CO),
J. Phys. Chem. A, 2000, 104, 17, 3905, https://doi.org/10.1021/jp993646q
. [all data]
Jacox, 2003
Jacox, M.E.,
Vibrational and electronic energy levels of polyatomic transient molecules: supplement B,
J. Phys. Chem. Ref. Data, 2003, 32, 1, 1-441, https://doi.org/10.1063/1.1497629
. [all data]