TlNC

Vibrational and/or electronic energy levels

Data compiled by: Marilyn E. Jacox

State:   X

Vib.
sym.
 No.   Approximate
 type of mode
 cm-1   Med.   Method   References

NC stretch 2047.7 Ar IR Lanzisera and Andrews, 1997

Additional references: Jacox, 2003, page 80

References

Lanzisera and Andrews, 1997
Lanzisera, D.V.; Andrews, L., Reactions of Laser-Ablated Al, Ga, In, and Tl Atoms with Hydrogen Cyanide in Excess Argon. Matrix Infrared Spectra and Density Functional Theory Calculations on New Cyanide and Isocyanide Products, J. Phys. Chem. A, 1997, 101, 50, 9660, https://doi.org/10.1021/jp972333x . [all data]

Jacox, 2003
Jacox, M.E., Vibrational and electronic energy levels of polyatomic transient molecules: supplement B, J. Phys. Chem. Ref. Data, 2003, 32, 1, 1-441, https://doi.org/10.1063/1.1497629 . [all data]